EUROBIS - Marine observations ontology
type: Ontology
version IRI: https://eurobis.org/ns/marine-observation/0.1
imports: top-level
creator: dv
creator: 0496vr396
creator: stlab
description: Dit is de ontologie van mariene waarnemingen. De term mariene waarnemingen verwijst naar alle verschillende metingen en waarnemingen van het bestaan van organismen die tijdens specifieke gebeurtenissen worden gedaan en in het EUROBIS-systeem worden gerapporteerd. @nl
description: Questa è l'ontologia delle osservazioni marine. Con il termine osservazioni marine si intende l'insieme di tutte le differenti misurazioni nonché osservazioni dell'esistenza di organismi che vengono effettuate durante eventi specifici e riportate nel sistema EUROBIS. @it
description: This is the ontology of marine observations. The term marine observations refers to all the different measurements as well as observations of the existence of organisms that are made during specific events and reported in the EUROBIS system.
issued: 2025-01-27
language: ENG
language: ITA
language: NLD
license: CC BY 4 0
modified: 2025-05-26
title: EUROBIS - Ontologia delle osservazioni marine @it
title: EUROBIS - Ontologie mariene waarnemingen @nl
version info: First version 0.1.
version info: Prima versione 0.1. @it
version info: versie 0.1. @nl

has marine feature of interest
type: ObjectProperty
sub property of: hasFeatureOfInterest
domain: Marine Observation
range: Bio Feature of Interest
comment: Eigenschap die wordt gebruikt om de habitat van de soort weer te geven. @nl
comment: Property used to represent the habitat of the species.
comment: Proprietà utilizzata per rappresentare l'habitat della specie. @it
label: ha caratteristica marina di interesse @it
label: heeft interessant marien kenmerk @nl

has observable property
type: ObjectProperty
sub property of: hasObservableProperty
inverse of: is observable property of
domain: Marine Observation
range: Observable Property
comment: Eigenschap die wordt gebruikt om een specifieke eigenschap van de mariene observatie weer te geven, zoals een biotische of abiotische eigenschap. @nl
comment: Property used to represent a specific property of the marine observation such as a biotic or abiotic property.
comment: Proprietà utilizzata per rappresentare una proprietà specifica dell'osservazione marina come può essere una proprietà biotica o abiotica. @it
label: ha proprietà osservabile @it
label: heeft waarneembare eigenschap @nl

has observation value
type: ObjectProperty
sub property of: hasResult
domain: Marine Observation
range: Observation Value
comment: Eigenschap die wordt gebruikt om een waarde te specificeren, hetzij numeriek met maateenheden of kwalitatief van de mariene observatie. @nl
comment: Property used to specify a value, be it numerical with units of measurement or qualitative of the marine observation.
comment: Proprietà utilizzata per specificare un valore, sia esso numerico con unità di misura sia esso qualitativo dell'osservazione marina. @it
label: ha valore osservazione @it
label: heeft observatiewaarde @nl

has occurred in habitat
type: ObjectProperty
sub property of: habitat
domain: Biodiversity Event
range: Environment
comment: Eigenschap die het mogelijk maakt om een gebeurtenis in de biodiversiteitssfeer te associëren met de omgeving/habitat waarin ze plaatsvindt. @nl
comment: Property allowing an event occurring in the biodiversity sphere to be associated with the environment/habitat in which it takes place.
comment: Proprietà che consente di associare un evento che si verifica in ambito biodiversità con l'ambiente/habitat in cui questo avviene. @it
label: is opgetreden in habitat @nl
label: si è verificato in habitat @it

has occurrence basis
type: ObjectProperty
sub property of: associatedWith
domain: Organism Occurrence
range: Occurrence Basis
comment: Eigenschap die het mogelijk maakt om de basis of aard of soort detectie van het bestaan van een bepaald organisme uit te drukken (bijv. menselijke observatie, observatie gedaan met software, door middel van bemonstering, gebaseerd op een bewaard exemplaar/fossiel, etc.). @nl
comment: Property that allows one to express the basis or nature or type of detection of the existence of a certain organism (e.g. human observation, observation made with software, through sampling, based on a preserved specimen/fossil, etc.).
comment: Proprietà che consente di esprimere la base o natura o tipologia di rilevamento dell'esistenza di un certo organismo (e.g., osservazione umana, osservazione fatta con software, attraverso un campionamento, basata su un esemplare preservato/fossile, ecc.). @it
label: ha natura dell'occorrenza @it
label: heeft basis van voorkomen @nl

has occurrence status
type: ObjectProperty
sub property of: occurrenceStatus
domain: Organism Occurrence
range: Occurrence Status
comment: Eigenschap waarmee men de toestand van de gebeurtenis kan uitdrukken die afwezig of aanwezig kan zijn op een bepaalde locatie. @nl
comment: Property that allows one to express the state of the occurrence that may be absent or present at a certain location.
comment: Proprietà che consente di esprimere lo stato dell'occorrenza che può essere assente o presente in un certo luogo. @it
label: ha stato dell'occorrenza @it
label: heeft voorvalstatus @nl

has organism quantity
type: ObjectProperty
sub property of: associatedWith
domain: Organism Occurrence
range: Value
comment: Eigenschap waarmee een hoeveelheid organismen kan worden weergegeven in de detectie van de aanwezigheid van organismen, uitgedrukt in een bepaalde meeteenheid.. @nl
comment: Property that allows a quantity of organisms to be represented in the detection of the presence of organisms, expressed in some unit of measurement.
comment: Proprietà che consente di rappresentare un quantitativo di organismi nel rilevamento della presenza di organismi, espresso in una qualche unità di misura. @it
label: ha quantità organismi @it
label: heeft hoeveelheid organisme @nl
usage note: Deze eigenschap kan worden gebruikt om gegevens te modelleren die in het OBIS-model organismehoeveelheid (organismQuantity) en organismehoeveelheidstype (organismQuantityType) worden genoemd. @nl
usage note: Questa proprietà può essere utilizzata per modellare i dati che nel modello OBIS vengono chiamati quantità organismi (organismQuantity) e tipo quantità organismi (organismQuantityType) @it
usage note: This property can be used to model data that in the OBIS model are called organism quantity (organismQuantity) and organism quantity type (organismQuantityType)

has size
type: ObjectProperty
sub property of: associatedWith
domain: Sample
range: Value
comment: Eigenschap waarmee de steekproefgrootte kan worden uitgedrukt. De steekproefgrootte wordt uitgedrukt met een object van het type Waarde dat een numerieke waarde en eventueel een meeteenheid kan hebben. Via deze eigenschap kunnen we uitdrukken wat in darwnin core de twee eigenschappen genaamd steekproefgrootte-eenheid (sampleSizeUnit) en steekproefgrootte-waarde (sampleSizeValue) zijn. @nl
comment: Property that allows the sample size to be expressed. The sample size is expressed with an object of type Value which may have a numerical value and potentially a unit of measurement. Through this property we are able to express what in darwnin core are the two properties called sample size unit (sampleSizeUnit) and sample size value (sampleSizeValue).
comment: Proprietà che consente di esprimere la dimensione del campione. La dimensione del campione è espressa con un oggetto di tipo Valore che può avere il valore numerico e potenzialmente l'unità di misura. Attraverso questa proprietà si riesce ad esprimere quello che in darwnin core sono le due proprietà chiamate unità della dimensione del campione (sampleSizeUnit) e valore della dimensione del campione (sampleSizeValue). @it
label: ha dimensione @it
label: heeft grootte @nl

is in the context of
type: ObjectProperty
sub property of: associatedWith
domain: Marine Observation
range: Marine Observation
comment: Eigenschap die gebruikt wordt om een mariene observatie aan een andere te koppelen, om aan te geven dat een bepaalde zeeobservatie plaatsvindt in de context van een andere. Het is bijvoorbeeld mogelijk om de waarneming van de behoeftigheid van een organisme te koppelen aan bepaalde biotische of abiotische metingen. @nl
comment: Property used to link one marine observation to another, to represent that a certain marine observation occurs in the context of another. For example, it is possible to link the observation of an organism's neediness with certain biotic or abiotic measurements.
comment: Proprietà utilizzata per collegare un'osservazione marina ad un'altra, per poter rappresentare che una certa osservazione marina avviene nel contesto di un'altra. Ad esempio è possibile collegare l'osservazione dell'occorrezza di un organismo con alcune misurazioni biotiche o abiotiche. @it
label: heeft aanvullende beschrijving @nl
label: è nel contesto di @it

is observable property of
type: ObjectProperty
sub property of: associatedWith
domain: Observable Property
range: Marine Observation
comment: Inverse eigenschap van “heeft waarneembare eigenschap” gebruikt om een mariene observatie te specificeren gegeven een waargenomen eigenschap. @nl
comment: Inverse property of ‘has observable property’ used to specify a marine observation given an observed property.
comment: Proprietà inversa di 'ha proprietà osservabile' utilizzata per specificare un'osservazione marina data una proprietà osservata. @it
label: heeft waarneembare eigenschap @nl
label: è proprietà osservabile di @it

is of organism named as
type: ObjectProperty
sub property of: associatedWith
domain: Organism Occurrence
range: TaxonName
comment: Eigenschap die het mogelijk maakt de naam van het referentie-taxon te specificeren in de waarneming betreffende het voorkomen van een bepaald organisme. @nl
comment: Property allowing the name of the reference taxon to be specified in the observation concerning the occurrence of a certain organism.
comment: Proprietà che consente di specificare il nome del taxon di riferimento nell'osservazione relativa alla occorrenza di un certo organismo. @it
label: is van organisme met de naam @nl
label: è di organismo chiamato come @it

is sub event of
type: ObjectProperty
sub property of: hasPart
type: TransitiveProperty
type: ReflexiveProperty
domain: Biodiversity Event
range: Biodiversity Event
comment: Eigenschap die een mogelijke hiërarchie van gebeurtenissen weergeeft. @nl
comment: Property representing a possible hierarchy of events.
comment: Proprietà che rappresenta una possibile gerarchia di eventi. @it
label: is subgebeurtenis van @nl
label: è sotto evento di @it

is sub sample of
type: ObjectProperty
sub property of: associatedWith
type: TransitiveProperty
domain: Sample
range: Sample
comment: Eigenschap die het creëren van hiërarchieën tussen monsters mogelijk maakt (in de context van mariene waarnemingen) @nl
comment: Property enabling the creation of hierarchies between samples (in the context of marine observations)
comment: Proprietà che consente di creare gerarchie tra campioni (nel contesto delle osservazioni marine). @it
label: is een deelmonster van @nl
label: è sottocampione di @it

made by
type: ObjectProperty
sub property of: associatedWith
domain: Marine Observation
range: Monitoring Facility
comment: Eigenschap die wordt gebruikt om de bewakingsfaciliteit te identificeren die de mariene observatie heeft uitgevoerd. @nl
comment: Property used to identify the monitoring facility that carried out the marine observation.
comment: Proprietà utilizzata per individuare la struttura di monitoraggio che ha svolto l'osservazione marina. @it
label: fatto da @it
label: gemaakt door @nl

made during event
type: ObjectProperty
sub property of: associatedWith
domain: Marine Observation
range: Biodiversity Event
comment: Eigenschap die wordt gebruikt om een mariene waarneming te koppelen aan de gebeurtenis waarin ze werd gedaan. @nl
comment: Property used to link a marine observation to the event in which it was made.
comment: Proprietà utilizzata per collegare un'osservazione marina all'evento in cui è stata fatta. @it
label: fatto durante evento @it
label: gemaakt tijdens evenement @nl

occurs in
type: ObjectProperty
sub property of: associatedWith
domain: Biodiversity Event
range: Feature
comment: Eigenschap waarmee de locatie van een bepaalde gebeurtenis kan worden weergegeven (in de context van mariene waarnemingen). @nl
comment: Property that allows one to represent the location of a certain event (in the context of marine observations).
comment: Proprietà che consente di rappresentare il luogo in cui è avvenuto un certo evento (nel contesto delle osservazioni marine). @it
label: avviene in @it
label: komt voor in @nl
usage note: Het wordt aanbevolen om deze eigenschap te gebruiken in combinatie met geolocaties/kenmerken die gedefinieerd zijn in Gazzettiers, zoals Marine Regions Gazzettier. Wanneer dat echter niet mogelijk is, kan deze eigenschap worden gebruikt in combinatie met een object van het type Feature of SpatialObject dat voor een dergelijk doel wordt aangemaakt. Om de nauwkeurigheid van de coördinaten en de onzekerheid in meters van de coördinaten aan te geven, wordt voorgesteld om respectievelijk de geo:hasSpatialResolution en geo:hasMetricSpatialAccuracy eigenschappen van de geosparql ontologie te gebruiken in de representatie van een geometrie geassocieerd met een locatie. @nl
usage note: It is recommened using this property in combination with geo locations/features that are defined in Gazzettiers, such as Marine Regions Gazzettier. However, when that is not possible, this property can be used associated with an object of type Feature or SpatialObject to be created for such a purpose. To indicate the accuracy of the coordinates and the uncertainty in metres of the coordinates, it is suggested that the geo:hasSpatialResolution and geo:hasMetricSpatialAccuracy properties, respectively, of the geosparql ontology be used in the representation of a geometry associated with a location/feature.
usage note: Si consiglia di utilizzare questa proprietà in combinazione con località geografiche/caratteristiche definite in Gazzettier, come il Gazzettier delle Regioni marine. Tuttavia, quando ciò non è possibile, questa proprietà può essere utilizzata associata a un oggetto di tipo Feature o SpatialObject da creare a tale scopo. Per indicare la precisione delle coordinate e l'incertezza in metri delle coordinate, si suggerisce di utilizzare le proprietà geo:hasSpatialResolution e geo:hasMetricSpatialAccuracy ,rispettivamente, dell'ontologia geosparql da utilizzare nella rappresentazione di una geometria associata a un luogo. @it

produces
type: ObjectProperty
sub property of: hasResult
domain: Sampling
range: Sample
comment: Eigenschap waarmee de bemonsteringsactiviteit kan worden gekoppeld aan het gerelateerde monster dat is aangemaakt. @nl
comment: Property that allows the sampling activity to be linked to the related sample created.
comment: Proprietà che consente di collegare l'attività di campionamento con il relativo campione creato. @it
label: produce @it
label: produceert @nl

uses method
type: ObjectProperty
sub property of: usedProcedure
domain: Sampling
range: Method
comment: Eigenschap die de methode voor bemonstering weergeeft (specifiek in de context van mariene waarnemingen). @nl
comment: Property representing the method used in sampling (specifically in the context of marine observations).
comment: Proprietà che rappresenta il metodo utilizzato nel campionamento (nello specifico nel contesto di osservazioni marine). @it
label: gebruikt methode @nl
label: utilizza metodo @it

continent in string
type: DatatypeProperty
sub property of: continent
domain: Feature
range: PlainLiteral
comment: A string to represent the continent of the place where an event takes place in the context of biodiversity
comment: Een tekenreeks om het continent weer te geven van de plaats waar een gebeurtenis plaatsvindt in de context van biodiversiteit @nl
comment: Una stringa per rappresentare il continente del luogo dove avviene un evento nel contesto della biodiversità @it
label: continent in tekenreeks @nl
label: continente in stringa @it
usage note: Het wordt aanbevolen om altijd unieke URI's te gebruiken om continenten te identificeren, mogelijk zelfs afgeleid van gecontroleerde vocabulaires. Als het niet mogelijk is om een continent te identificeren door het gebruik van een object geïdentificeerd door een URI, dan kan deze eigenschap worden gebruikt om het te specificeren in tekenreeksvorm. @nl
usage note: It is recommended to always use unique URIs to identify continents, possibly even derived from controlled vocabularies. If it is not possible to identify a continent through the use of an object identified by a URI, then this property may be used to specify it in string form.
usage note: È raccomandato utilizzare sempre URI univoci per identificare continenti, possibilmente anche ricavati da vocabolari controllati. Qualora non sia possibile identificare un continente attraverso l'uso di un oggetto identificato da un URI, allora questa proprietà può essere usata per specificarlo sottoforma di stringa. @it

maximum depth in meters
type: DatatypeProperty
sub property of: maximumDepthInMeters
domain: Sample
range: integer
comment: Het maximale niveau van een diepte-interval onder het lokale oppervlak, uitgedrukt in meters. De diepte verwijst naar waar het monster werd genomen. @nl
comment: Il livello massimo di un intervallo di profondità sotto la superficie locale, espresso in metri. La profondità è riferita a dove il campione è stato preso. @it
comment: The maximum level of a depth interval below the local surface, expressed in metres. The depth refers to where the sample was taken.
label: massima profondità in metro @it
label: maximale diepte in meters @nl

minimum depth in meters
type: DatatypeProperty
sub property of: minimumDepthInMeters
domain: Sample
range: integer
comment: Het minimumniveau van een diepte-interval onder het lokale oppervlak, uitgedrukt in meters. De diepte verwijst naar waar het monster werd genomen. @nl
comment: Il livello minimo di un intervallo di profondità sotto la superficie locale, espresso in metri. La profondità è riferita a dove il campione è stato preso. @it
comment: The minimum level of a depth interval below the local surface, expressed in metres. The depth refers to where the sample was taken.
label: minimumdiepte in meters @nl
label: profondità minima in metri @it

sampling effort
type: DatatypeProperty
sub property of: samplingEffort
domain: Sampling
range: PlainLiteral
comment: De hoeveelheid moeite voor bemonstering. Voorbeelden zijn: 10 waarnemersuren, enz. @nl
comment: La quantità di sforzo per il campionamento. Esempi includono: 10 ore di osservazione, ecc. @it
comment: The amount of effort for sampling. Examples include: 10 observer hours,
comment: The amount of effort for sampling. Examples include: 10 observer hours, etc.
label: bemonsteringsinspannings @nl
label: impegno per campionamento @it

sampling protocol in string
type: DatatypeProperty
sub property of: samplingProtocol
domain: Sampling
range: PlainLiteral
comment: A string through which to specify/describe the protocol used for sampling.
comment: Een tekenreeks om het protocol te specificeren/beschrijven dat wordt gebruikt voor bemonstering. @nl
comment: Una stringa attraverso cui specificare/descrivere il protocollo utilizzato per il campionamento. @it
label: bemonsteringsprotocol in tekenreeks @nl
label: protocollo di campionamento in stringa @it
usage note: Het wordt altijd aanbevolen om het protocol uit te drukken met een URI, zodat dezelfde protocollen/methoden kunnen worden hergebruikt in andere bemonsteringen door het gebruik van een unieke URI. Echter, in alle gevallen waar dit niet mogelijk is, kan deze eigenschap gebruikt worden door het te associëren met de monsternamegebeurtenis. @nl
usage note: It is always recommended to express the protocol using a URI, so that the same protocols/methods can be reused in other samplings through the use of a unique URI. However, in all those cases where this is not possible, one can use this property by associating it with the sampling event.
usage note: Si raccomanda sempre di esprimere il protocollo utilizzando un URI, così che stessi protocolli/metodi possano essere riutilizzati in altri campionamenti attraverso l'uso di un URI univoco. Tuttavia, in tutti quei casi in cui ciò non è possibile, si può utilizzare questa proprietà associandola all'evento di campionamento. @it

Abiotic Assertion
type: Class
subclass of: Assertion
disjoint with: Biotic Assertion
comment: De klasse vertegenwoordigt een specifiek type bewering gericht op het detecteren van abiotische factoren, d.w.z. niet-levende componenten van een omgeving die het leven van organismen beïnvloeden. @nl
comment: La classe rappresenta uno specifico tipo di asserzione volta a rilevare fattori abiotici, i.e., componenti non viventi di un ambiente che influenzano la vita degli organismi. @it
comment: The class represents a specific type of assertion aimed at detecting abiotic factors, i.e. non-living components of an environment that influence the life of organisms.
label: Abiotische Bewering @nl
label: Asserzione Abiotica @it

Abiotic Property
type: Class
subclass of: Observable Property
disjoint with: Biotic Property
comment: De klasse van abiotische attributen of eigenschappen die waarneembaar zijn tijdens een observatie (marien). Dit zijn eigenschappen die geen verband houden met biologische aspecten van levende organismen. In plaats daarvan zijn het eigenschappen die betrekking hebben op de omgeving zoals water, lucht, wind, enz. die een invloed kunnen hebben op levende organismen. @nl
comment: La classe degli attributi o proprietà abiotiche osservabili durante un'osservazione (marina). Si intendono attributi non riferibili agli aspetti biologici di organismi viventi. Sono invece proprietà relative all'ambiente circostante come l'acqua, l'aria, vento, ecc. che possono avere un impatto sugli organismi viventi. @it
comment: The class of abiotic attributes or properties observable during an observation (marine). These are attributes that do not relate to biological aspects of living organisms. Instead, they are properties relating to the surrounding environment such as water, air, wind, etc. that can have an impact on living organisms.
label: Abiotische eigenschappen @nl
label: Proprietà Abiotica @it

Assertion
type: Class
subclass of: MeasurmentOrFact
subclass of: Marine Observation
comment: De klasse vertegenwoordigt de actie om iets te bevestigen. In de context van deze ontologie is assertatie een soort mariene observatie gerelateerd aan het rapporteren van abiotische en biotische eigenschappen. Voorbeelden zijn: het gewicht van een organisme in gram, de temperatuur van het oppervlaktewater in Celsius, enz. @nl
comment: La classe rappresenta l'azione di asserire qualcosa. Nel contesto di questa ontologia, l'asserzione è un tipo di osservazione marina relativa alla segnalazione di proprietà abiotiche e biotiche. Alcuni esempi sono: il peso di un organismo in grammi, la temperatura dell'acqua superficiale in gradi Celsius, ecc. @it
comment: The class represents the action of asserting something. In the context of this ontology, assertion is a type of marine observation related to the reporting of abiotic and biotic properties. Examples include: the weight of an organism in grams, surface water temperature in Celsius, etc.
label: Asserzione @it
label: Bevestiging @nl
usage note: Aangezien een bevestiging een specifiek type mariene observatie is, kunnen alle eigenschappen van darwin core zoals measurementValue, measurementUnit van een meting van een Fact-entiteit worden gemodelleerd via de ObservationValue van de MarineObservation. Het MeasurementType en MeasurementTypeID kunnen worden uitgedrukt via de entiteit ObservableProperty van de MarineObservation die ook kan worden gedefinieerd in de context van BODC-gecontroleerde vocabulaires. @nl
usage note: Poiché una asserzione è un tipo specifico di osservazione marina, tutte le proprietà di darwin core come measurementValue, measurementUnit di un'entità Measurement of Fact possono essere modellate attraverso ObservationValue di MarineObservation. Il MeasurementType e il MeasurementTypeID possono essere espressi attraverso l'entità ObservableProperty della MarineObservation, che può essere definita anche nel contesto dei vocabolari controllati BODC. @it
usage note: Since an assertion is a specific type of Marine Observation, all those properties of darwin core like measurementValue, measurementUnit can be modelled through the ObservationValue of the MarineObservation, while the MeasurementType and MeasurementTypeID through the entity ObservableProperty that can be also defined in the context of BODC controlled vocabularies.

Biodiversity Event
type: Class
subclass of: Event
subclass of: BioEvent
subclass of: Restriction
  on property: hasType
  some values from: Event Type
subclass of: Restriction
  on property: has occurred in habitat
  some values from: Environment
subclass of: Restriction
  on property: hasTemporalEntity
  all values from: TemporalEntity
subclass of: Restriction
  on property: is sub event of
  all values from: Biodiversity Event
subclass of: Restriction
  on property: occurs in
  qualified cardinality: 1
  on class: Feature
subclass of: Restriction
  on property: date
  cardinality: 1
subclass of: Restriction
  on property: identier
  cardinality: 1
comment: Deze klasse vertegenwoordigt specifieke acties die plaatsvinden op een bepaalde plaats en tijd in de context van biodiversiteit. De klasse is semantisch afgestemd op de Event-klasse van Darwin Core en de Bio Event-klasse van de Bige-Onto ontologie die wordt gebruikt om gegevens in openbare bestanden zoals GBIF en OBIS te modelleren. Voorbeelden van gebeurtenissen zijn: een gebeurtenis bij het verzamelen van specimens, een gebeurtenis bij het verwerven van beelden, een viscampagne met sleepnetten, enz. @nl
comment: Questa classe rappresenta azioni specifiche che avvengono in un certo luogo e in un certo tempo nel contesto della biodiversità. La classe è allineata semanticamente alla classe Evento di Darwin Core e alla classe Bio Evento dell'ontologia Bige-Onto usata per modellare i dati contenuti in registri pubblici come GBIF e OBIS. Esempi di eventi includono: un evento di raccolta di esemplari, un evento di acquisizione immagini, una campagna di pesca marina con rete a strascico, ecc. @it
comment: This class represents specific actions that occur at a certain place and time in the context of biodiversity. The class is semantically aligned to the Event class of Darwin Core and the Bio Event class of the Bige-Onto ontology used to model data contained in public records such as GBIF and OBIS. Examples of events include: a specimen collection event, an image acquisition event, a marine trawl fishing campaign, etc.
label: Biodiversiteitsevenement @nl
label: Evento Biodiversità @it
usage note: Om de tijdsdimensie van de gebeurtenis te specificeren, is het mogelijk om de generieke eigenschap date van dublin core te gebruiken, waarvan het bereik de superklasse is van de primitieve types rdfs:Literal (dit vertegenwoordigt de darwin core-eigenschap eventDate die vereist is in OBIS). Dit betekent dat het specifieke type van het bereik verder kan worden aangegeven volgens het type van de datum. Als het datum en tijd is, zal het xsd:dateTime zijn, als het alleen een datum is kan het xsd:date zijn, enz. Merk op dat in het geval dat een complexere timing moet worden uitgedrukt, het mogelijk is om de eigenschap top-level:hasTemporalEntity te gebruiken en dan de maand, het jaar, een generieke tijd in een string, enz. aan te geven. Met deze modellering kunnen gegevens die worden uitgedrukt met behulp van eigenschappen van darwin core zoals eventTime, jaar, maand, startDayOfYear, endDayOfYear in een robuustere semantische modellering worden weergegeven. @nl
usage note: Per specificare la dimensione temporale dell'evento, è possibile utilizzare la proprietà generica date di dublin core, il cui range è la superclasse dei tipi primitivi rdfs:Literal (rappresenta la proprietà eventDate di darwin core, richiesta in OBIS). Ciò significa che il tipo specifico può essere ulteriormente indicato in base al tipo di dato. Se si tratta di una data e ora, sarà xsd:dateTime, se è solo una data può essere xsd:date, ecc. Si noti che nel caso in cui sia necessario esprimere una tempistica più complessa, è possibile utilizzare la proprietà top-level:hasTemporalEntity e quindi indicare il mese, l'anno, un orario generico in stringa, ecc. Questa modellazione consente di rappresentare in modo più robusto i dati semantici espressi utilizzando proprietà di darwin core come eventTime, year, month, startDayOfYear, endDayOfYear. @it
usage note: To specify the temporal dimension of the event, it is possible to use the generic property date of dublin core whose range is the superclass of primitive types rdfs:Literal (this represents the darwin core property eventDate required in OBIS). This means that the specific type can be further indicated according to the type of date. If it is date and time it will be xsd:dateTime, if it is only a date it can be xsd:date, etc. Please note that in the case more complex timing is required to be express it is possible to use the property top-level:hasTemporalEntity and then indicate the month, the year, a generic time in string, etc. This modelling allows to represent in a more robust semantic modelling data expressed using properties of darwin core like eventTime, year, month, startDayOfYear, endDayOfYear.
was influenced by: BioEvent

Bio Feature of Interest
type: Class
subclass of: FeatureOfInterest
subclass of: Class
  union of: Event
  union of: InformationEntity
  union of: Object
comment: De klasse van dingen waarvan de eigenschappen worden gedetecteerd of waargenomen in de loop van een zeeobservatie om tot een eindwaarde te komen. Voorbeelden zijn een deel van de zee, een rivier, een verzameling organismen, de lucht, enz. @nl
comment: La classe di cose la cui proprietà viene rilevata o osservata nel corso di un'osservazione marina per arrivare a un valore finale. Esempi includono, un'area del mare, un fiume, un insieme di organismi, l'aria, ecc. @it
comment: The class of the things whose property is being detected or observed in the course of a Marine Observation to arrive at a final value. Examples include: an area of the sea, a river, a collection of organisms, the air, etc.
label: Bio Eigenschap Van Belang @nl
label: Caratteristica di Interesse Bio @it

Biotic Assertion
type: Class
subclass of: Assertion
comment: De klasse vertegenwoordigt een specifiek type bewering gericht op het detecteren van biotische factoren, d.w.z. factoren met betrekking tot levende organismen die het ecosysteem beïnvloeden. @nl
comment: La classe rappresenta uno specifico tipo di asserzione volta a rilevare fattori biotici, i.e., fattori relativi a organismi viventi che influenzano l'ecosistema. @it
comment: The class represents a specific type of assertion aimed at detecting biotic factors, i.e., factors relating to living organisms that influence the ecosystem.
label: Biotische Bewering @nl
label: Asserzione biotica @it

Biotic Property
type: Class
subclass of: Observable Property
comment: De klasse van biotische kenmerken of eigenschappen die waarneembaar zijn tijdens een observatie (marien). Dit zijn attributen die verwijzen naar levende organismen of iets dat ooit leefde. @nl
comment: La classe degli attributi o proprietà biotiche osservabili durante un'osservazione (marina). Si intendono attributi riferibili a organismi viventi o qualcosa che un tempo era vivo. @it
comment: The class of biotic attributes or properties observable during an observation (marine). These are attributes referring to living organisms or something that was once alive.
label: Biotische eigenschappen @nl
label: Proprietà Biotica @it

Event Type
type: Class
subclass of: Concept
subclass of: Type
comment: De klasse van gebeurtenistypes in de context van biodiversiteit. Voorbeelden zijn: sitebezoek, project, biotische interactie, observatie, enz. @nl
comment: La classe dei tipi di eventi nel contesto della biodiversità. Esempi includono: visita in un luogo, progetto, interazione biotica, osservazione, ecc. @it
comment: The class of event types in the context of biodiversity. Examples include: site visit, project, biotic interaction, observation, etc.
label: Soort evenement @nl
label: Tipo Evento @it

Marine Observation
type: Class
subclass of: Observation
subclass of: Biodiversity Event
subclass of: Restriction
  on property: is in the context of
  all values from: Marine Observation
subclass of: Restriction
  on property: made by
  all values from: Monitoring Facility
subclass of: Restriction
  on property: made during event
  all values from: Biodiversity Event
subclass of: Restriction
  on property: has marine feature of interest
  qualified cardinality: 1
  on class: Bio Feature of Interest
subclass of: Restriction
  on property: has observable property
  qualified cardinality: 1
  on class: Observable Property
subclass of: Restriction
  on property: has observation value
  qualified cardinality: 1
  on class: Observation Value
comment: De klasse vertegenwoordigt een waarneming uitgevoerd in de context van mariene biodiversiteit. In het algemeen wordt een waarneming gedefinieerd als een activiteit waarbij de waarde van een eigenschap van een kenmerk van belang volgens een bepaalde methode of procedure wordt berekend. @nl
comment: La classe rappresenta un'osservazione effettuata nel contesto della biodiversità marina. In generale, per osservazione si intende un'attività volta a calcolare il valore di una proprietà di una caratteristica di interesse in base a un determinato metodo o procedura. @it
comment: The class represents an observation carried out in the context of marine biodiversity. In general, an observation is defined as an activity to calculate the value of a property of a characteristic of interest according to a certain method or procedure.
label: Mariene Observatie @nl
label: Osservazione Marina @it

Monitoring Facility
type: Class
subclass of: Object
subclass of: Platform
comment: De klasse van entiteiten die worden gebruikt als bewakingsfaciliteiten om (mariene) waarnemingen uit te voeren en zo gegevens te verzamelen over die. In de context van deze ontologie is een voorbeeld het schip/boot. @nl
comment: La classe delle entità adibite a strutture di monitoraggio per effettuare osservazioni (marine) e quindi acquisire dati su quelle. Nel contesto di questa ontologia un esempio è rappresentato dal vascello/imbarcazione. @it
comment: The class of entities used as monitoring facilities to carry out (marine) observations and thus acquire data on those. In the context of this ontology, an example is the vessel/boat.
label: Bewakingsfaciliteit @nl
label: Struttura di Monitoraggio @it
was influenced by: PlatformTypeValue
was influenced by: ef

Observable Property
type: Class
subclass of: Quality
subclass of: Concept
subclass of: ObservableProperty
subclass of: Restriction
  on property: is observable property of
  all values from: Marine Observation
comment: De klasse van attributen of eigenschappen die kunnen worden waargenomen/detecteerd tijdens een observatie (marien). Dit kan op zijn beurt, in de context van deze ontologie, worden gespecialiseerd in biotische en abiotische eigenschappen. @nl
comment: La classe degli attributi o proprietà osservabili/rilevabili durante un'osservazione (marina). Questa può essere a sua volta specializzata, nel contesto di questa ontologia, in proprietà biotiche e abiotiche. @it
comment: The class of attributes or properties that can be observed/detected during an observation (marine). This in turn can be specialised, in the context of this ontology, into biotic and abiotic properties.
label: Proprietà Osservabile/Rilevabile @it
label: Waarneembaar eigendom @nl
usage note: Het wordt aanbevolen om URI's van de gecontroleerde vocabulaires gedefinieerd in BODC te gebruiken om de waarneembare eigenschappen uit te drukken. In alle gevallen waarin geen URI's kunnen worden gevonden, is het mogelijk om een object van dit type ObservableProperty te maken. Het wordt altijd aanbevolen om URI's te gebruiken om de waarneembare eigenschappen uit te drukken, in plaats van eenvoudige strings. @nl
usage note: It is recommended to use URIs of the controlled vocabularies defined in BODC to express the observable properties. In all those cases in which URIs cannot be found, it is possible to create an object of this type ObservableProperty. It is always recommended to use URIs to express the observable properties, rather than simple strings.
usage note: Si raccomanda di utilizzare gli URI dei vocabolari controllati definiti nel contesto di BODC per esprimere le proprietà osservabili. In tutti i casi in cui non è possibile trovare URI, si può creare un oggetto di questo tipo ObservableProperty. Si raccomanda sempre di utilizzare URI per esprimere le proprietà osservabile, piuttosto che semplici stringhe. @it

Observation Value
type: Class
subclass of: Result
subclass of: Value
subclass of: Class
  union of: Object
  union of: Region
comment: De klasse voor de weergave van het resultaat van de waarneming (marien). Dit kan een kwantitatieve waarde zijn die wordt uitgedrukt in een meeteenheid of een kwalitatieve waarde die wordt uitgedrukt als een normale tekststring. @nl
comment: La classe che consente di rappresentare il risultato dell'osservazione (marina). Questo può essere un valore quantitativo espresso in un'unità di misura o qualitativo espresso come una normale stringa di testo. @it
comment: The class for representing the result of the observation (marine). This may be a quantitative value expressed in a unit of measurement or a qualitative value expressed as a normal text string.
label: Valore Osservazione @it
label: Waarnemingswaarde @nl

Occurrence Basis
type: Class
subclass of: Concept
comment: De klasse modelleert de basis of de aard of het type detectie van het bestaan van een bepaald organisme. De individuen kunnen menselijke observatie zijn, observatie met software, door bemonstering, gebaseerd op een bewaard exemplaar/fossiel, enz. @nl
comment: La classe modella la base o la natura o il tipo di rilevamento dell'esistenza di un certo organismo. I suoi individui possono essere l'osservazione umana, l'osservazione effettuata con un software, attraverso il campionamento, sulla base di un esemplare/fossile conservato, ecc. @it
comment: The class models the basis or nature or type of detection of the existence of a certain organism. Its individuals can be human observation, observation made with software, through sampling, based on a preserved specimen/fossil, etc.
label: Natura Occorrenza @it
label: Voorval Basis @nl

Occurrence Status
type: Class
comment: De klasse modelleert de staat van voorkomen van organismen. De toestand kan twee waarden aannemen: aanwezig of afwezig. @nl
comment: La classe modella lo stato dell'occorrenza di organismi. Lo stato può assumere due valori: presente o assente. @it
comment: The class models the state of the occurrence of organisms. The state can take two values: present or absent.
label: Stato Occorrenza @it
label: Voorvalstatus @nl

Organism Occurrence
type: Class
subclass of: Occurrence
subclass of: Marine Observation
subclass of: Restriction
  on property: has occurrence basis
  qualified cardinality: 1
  on class: Occurrence Basis
subclass of: Restriction
  on property: has occurrence status
  qualified cardinality: 1
  on class: Occurrence Status
subclass of: Restriction
  on property: has organism quantity
  qualified cardinality: 1
  on class: Value
subclass of: Restriction
  on property: is of organism named as
  qualified cardinality: 1
  on class: TaxonName
comment: De klasse vertegenwoordigt een specifiek type mariene observatie gericht op het detecteren van de aanwezigheid van een bepaald organisme op een bepaalde plaats en tijd. @nl
comment: La classe rappresenta uno specifico tipo di osservazione marina volta a rilevare la presenza di un certo organismo in un certo luogo e in un certo tempo. @it
comment: The class represents a specific type of marine observation aimed at detecting the presence of a certain organism at a certain place and time.
label: Esistenza Organismo @it
label: Organisme Voorkomenn @nl

Sample
type: Class
subclass of: MaterialSample
subclass of: Sample
subclass of: Bio Feature of Interest
subclass of: Restriction
  on property: has size
  some values from: Value
subclass of: Restriction
  on property: is sub sample of
  all values from: Sample
subclass of: Restriction
  on property: maximum depth in meters
  qualified cardinality: 1
  on data range: integer
subclass of: Restriction
  on property: minimum depth in meters
  qualified cardinality: 1
  on data range: integer
comment: De klasse vertegenwoordigt het monster, d.w.z. een materiële entiteit die een geheel of een deel van een belangrijk element van de waarneming (marien) vertegenwoordigt. Monsters zijn meestal deelverzamelingen of uittreksels van het element van belang van een waarneming en worden gebruikt in situaties waar directe waarnemingen van het uiteindelijke element van belang niet mogelijk zijn, ofwel omdat het volledige element niet kan worden waargenomen of omdat het handiger is om een proxy te gebruiken. Bijvoorbeeld een heel organisme, een watermonster, een marien microbieel monster, enz. @nl
comment: La classe rappresenta il campione, cioè un'entità materiale che rappresenta in tutto o in parte un'elemento di interesse dell'osservazione (marina). I campioni sono in genere sottoinsiemi o estratti dell'elemento di interesse di un'osservazione e vengono utilizzati in situazioni in cui non è possibile effettuare osservazioni dirette sull'elemento di interesse finale, sia perché non è possibile osservare l'intero elemento, sia perché è più conveniente utilizzare un proxy. Ad esempio, un intero organismo, un campione dell'acqua, un campione microbico marino, ecc. @it
comment: The class represents the sample, i.e. a material entity representing all or part of an element of interest of the observation (marine). Samples are usually subsets or extracts of the element of interest of an observation and are used in situations where direct observations of the final element of interest cannot be made, either because the entire element cannot be observed or because it is more convenient to use a proxy. For example, a whole organism, a water sample, a marine microbial sample, etc.
label: Campione @it
label: Voorbeeld @nl

Sampling
type: Class
subclass of: Sampling
subclass of: Biodiversity Event
subclass of: Restriction
  on property: produces
  some values from: Sample
subclass of: Restriction
  on property: uses method
  some values from: Method
subclass of: Restriction
  on property: sampling effort
  some values from: PlainLiteral
subclass of: Restriction
  on property: sampling protocol in string
  all values from: PlainLiteral
comment: De klasse vertegenwoordigt de handeling van het creëren van een steekproef voor observatie (marien), op basis van een specifieke gebruikte methode. @nl
comment: La classe rappresenta l'atto di creare un campione per effettuare un'osservazione (marina), sulla base di uno specifico metodo utilizzato. @it
comment: The class represents the act of creating a sample to make an observation (marine), based on a specific method used.
label: Bemonstering @nl
label: Campionamento @it
was influenced by: Event

Vessel
type: Class
subclass of: Monitoring Facility
comment: De klasse vertegenwoordigt een specifiek type bewakingsfaciliteit, d.w.z. een schip of groot schip, waar mariene waarnemingen worden uitgevoerd. @nl
comment: La classe rappresenta una specifica tipologia di struttura di monitoraggio ossia una nave o una grande imbarcazione, dove si effettuano osservazioni marine. @it
comment: The class represents a specific type of monitoring facility, i.e. a ship or large vessel, where marine observations are carried out.
label: Schip @nl
label: Vascello @it

Absent
type: NamedIndividual
type: Occurrence Status
label: Afwezig @nl
label: Assente @it

Present
type: NamedIndividual
type: Occurrence Status
label: Aanwezig @nl
label: Presente @it